Reaction Details
TargetBone morphogenetic protein 1
LigandBDBM50093840
Substrate/Competitorn/a
Meas. Tech.ChEBML_158893
IC50 32±n/a nM
Citation Dankwardt, SMBilledeau, RJLawley, LKAbbot, SCMartin, RLChan, CSVan Wart, HEWalker, KA Solid-phase synthesis of di- and tripeptidic hydroxamic acids as inhibitors of procollagen C-proteinase. Bioorg Med Chem Lett10:2513-6 (2001) Bone morphogenetic protein 1
Name:Bone morphogenetic protein 1
Type:PROTEIN
Mol. Mass.:111254.03
Organism:Homo sapiens (Human)
Description:ChEMBL_518962
Residue:986
BDBM50093840
NameBDBM50093840
Synonyms:(2S,3S)-2-(4,5-Dibromo-thiophene-2-sulfonylamino)-3-methyl-pentanoic acid (1-hydroxycarbamoyl-2-thiazol-4-yl-ethyl)-amide | CHEMBL313708
TypeSmall organic molecule
Emp. Form.C16H20Br2N4O5S3
Mol. Mass.604.357
SMILESCC[C@H](C)[C@H](NS(=O)(=O)c1cc(Br)c(Br)s1)C(=O)NC(Cc1cscn1)C(=O)NO