Reaction Details
TargetBone morphogenetic protein 1
LigandBDBM50093871
Substrate/Competitorn/a
Meas. Tech.ChEBML_158893
IC50 29±n/a nM
Citation Dankwardt, SMBilledeau, RJLawley, LKAbbot, SCMartin, RLChan, CSVan Wart, HEWalker, KA Solid-phase synthesis of di- and tripeptidic hydroxamic acids as inhibitors of procollagen C-proteinase. Bioorg Med Chem Lett10:2513-6 (2001) Bone morphogenetic protein 1
Name:Bone morphogenetic protein 1
Type:PROTEIN
Mol. Mass.:111254.03
Organism:Homo sapiens (Human)
Description:ChEMBL_518962
Residue:986
BDBM50093871
NameBDBM50093871
Synonyms:(2R,3R)-2-(2,5-Dichloro-benzenesulfonylamino)-3-methyl-pentanoic acid ((R)-1-hydroxycarbamoyl-2-thiazol-4-yl-ethyl)-amide | CHEMBL83631
TypeSmall organic molecule
Emp. Form.C18H22Cl2N4O5S2
Mol. Mass.509.427
SMILESCC[C@@H](C)[C@@H](NS(=O)(=O)c1cc(Cl)ccc1Cl)C(=O)N[C@H](Cc1cscn1)C(=O)NO