Reaction Details
TargetBone morphogenetic protein 1
LigandBDBM50093872
Substrate/Competitorn/a
Meas. Tech.ChEBML_158893
IC50 49±n/a nM
Citation Dankwardt, SMBilledeau, RJLawley, LKAbbot, SCMartin, RLChan, CSVan Wart, HEWalker, KA Solid-phase synthesis of di- and tripeptidic hydroxamic acids as inhibitors of procollagen C-proteinase. Bioorg Med Chem Lett10:2513-6 (2001) Bone morphogenetic protein 1
Name:Bone morphogenetic protein 1
Type:PROTEIN
Mol. Mass.:111254.03
Organism:Homo sapiens (Human)
Description:ChEMBL_518962
Residue:986
BDBM50093872
NameBDBM50093872
Synonyms:(2R,3R)-3-Methyl-2-(2,4,5-trichloro-benzenesulfonylamino)-pentanoic acid ((R)-1-hydroxycarbamoyl-2-thiazol-4-yl-ethyl)-amide | CHEMBL313932
TypeSmall organic molecule
Emp. Form.C18H21Cl3N4O5S2
Mol. Mass.543.872
SMILESCC[C@@H](C)[C@@H](NS(=O)(=O)c1cc(Cl)c(Cl)cc1Cl)C(=O)N[C@H](Cc1cscn1)C(=O)NO