Reaction Details
TargetBone morphogenetic protein 1
LigandBDBM50093876
Substrate/Competitorn/a
Meas. Tech.ChEBML_158893
IC50 43±n/a nM
Citation Dankwardt, SMBilledeau, RJLawley, LKAbbot, SCMartin, RLChan, CSVan Wart, HEWalker, KA Solid-phase synthesis of di- and tripeptidic hydroxamic acids as inhibitors of procollagen C-proteinase. Bioorg Med Chem Lett10:2513-6 (2001) Bone morphogenetic protein 1
Name:Bone morphogenetic protein 1
Type:PROTEIN
Mol. Mass.:111254.03
Organism:Homo sapiens (Human)
Description:ChEMBL_518962
Residue:986
BDBM50093876
NameBDBM50093876
Synonyms:CHEMBL83127 | {1-[(1S,2R)-1-((S)-1-Hydroxycarbamoyl-2-thiazol-4-yl-ethylcarbamoyl)-2-methyl-butylcarbamoyl]-3-methylsulfanyl-propyl}-carbamic acid benzyl ester
TypeSmall organic molecule
Emp. Form.C25H35N5O6S2
Mol. Mass.565.705
SMILESCC[C@@H](C)[C@H](NC(=O)C(CCSC)NC(=O)OCc1ccccc1)C(=O)N[C@@H](Cc1cscn1)C(=O)NO