Reaction Details
TargetEndothelin receptor type B
LigandBDBM50093993
Substrate/Competitorn/a
Meas. Tech.ChEBML_64040
IC50 2.6±n/a nM
Citation Zhang, JDidierlaurent, SFortin, MLefrançois, DUridat, EVevert, JP Potent nonpeptide endothelin antagonists: synthesis and structure-activity relationships of pyrazole-5-carboxylic acids. Bioorg Med Chem Lett10:2575-8 (2001) Endothelin receptor type B
Name:Endothelin receptor type B
Type:Enzyme Catalytic Domain
Mol. Mass.:49483.43
Organism:RAT
Description:ENDOTHELIN B EDNRB RAT::P21451
Residue:442
BDBM50093993
NameBDBM50093993
Synonyms:4-(6-Chloro-benzo[1,3]dioxol-5-ylmethyl)-2-cyclohexylmethyl-5-phenyl-2H-pyrazole-3-carboxylic acid | CHEMBL87070
TypeSmall organic molecule
Emp. Form.C25H25ClN2O4
Mol. Mass.452.93
SMILESOC(=O)c1c(Cc2cc3OCOc3cc2Cl)c(nn1CC1CCCCC1)-c1ccccc1