Reaction Details
TargetEndothelin-1 receptor
LigandBDBM50093998
Substrate/Competitorn/a
Meas. Tech.ChEBML_63349
IC50 17±n/a nM
Citation Zhang, JDidierlaurent, SFortin, MLefrançois, DUridat, EVevert, JP Potent nonpeptide endothelin antagonists: synthesis and structure-activity relationships of pyrazole-5-carboxylic acids. Bioorg Med Chem Lett10:2575-8 (2001) Endothelin-1 receptor
Name:Endothelin-1 receptor
Type:Enzyme Catalytic Domain
Mol. Mass.:48256.91
Organism:RAT
Description:ENDOTHELIN A EDNRA RAT::P26684
Residue:426
BDBM50093998
NameBDBM50093998
Synonyms:4-(6-Chloro-benzo[1,3]dioxol-5-ylmethyl)-2-(3-chloro-benzyl)-5-phenyl-2H-pyrazole-3-carboxylic acid | CHEMBL315622
TypeSmall organic molecule
Emp. Form.C25H18Cl2N2O4
Mol. Mass.481.327
SMILESOC(=O)c1c(Cc2cc3OCOc3cc2Cl)c(nn1Cc1cccc(Cl)c1)-c1ccccc1