Reaction Details
TargetEndothelin-1 receptor
LigandBDBM50093996
Substrate/Competitorn/a
Meas. Tech.ChEBML_63349
IC50 1.1±n/a nM
Citation Zhang, JDidierlaurent, SFortin, MLefrançois, DUridat, EVevert, JP Potent nonpeptide endothelin antagonists: synthesis and structure-activity relationships of pyrazole-5-carboxylic acids. Bioorg Med Chem Lett10:2575-8 (2001) Endothelin-1 receptor
Name:Endothelin-1 receptor
Type:Enzyme Catalytic Domain
Mol. Mass.:48256.91
Organism:RAT
Description:ENDOTHELIN A EDNRA RAT::P26684
Residue:426
BDBM50093996
NameBDBM50093996
Synonyms:4-(6-Chloro-benzo[1,3]dioxol-5-ylmethyl)-2-cyclohexylmethyl-5-thiophen-3-yl-2H-pyrazole-3-carboxylic acid | CHEMBL313044
TypeSmall organic molecule
Emp. Form.C23H23ClN2O4S
Mol. Mass.458.958
SMILESOC(=O)c1c(Cc2cc3OCOc3cc2Cl)c(nn1CC1CCCCC1)-c1ccsc1