Reaction Details
TargetEndothelin receptor type B
LigandBDBM50093997
Substrate/Competitorn/a
Meas. Tech.ChEBML_64040
IC50 1.7±n/a nM
Citation Zhang, JDidierlaurent, SFortin, MLefrançois, DUridat, EVevert, JP Potent nonpeptide endothelin antagonists: synthesis and structure-activity relationships of pyrazole-5-carboxylic acids. Bioorg Med Chem Lett10:2575-8 (2001) Endothelin receptor type B
Name:Endothelin receptor type B
Type:Enzyme Catalytic Domain
Mol. Mass.:49483.43
Organism:RAT
Description:ENDOTHELIN B EDNRB RAT::P21451
Residue:442
BDBM50093997
NameBDBM50093997
Synonyms:4-(6-Chloro-benzo[1,3]dioxol-5-ylmethyl)-2-cyclohexylmethyl-5-thiophen-2-yl-2H-pyrazole-3-carboxylic acid | CHEMBL313153
TypeSmall organic molecule
Emp. Form.C23H23ClN2O4S
Mol. Mass.458.958
SMILESOC(=O)c1c(Cc2cc3OCOc3cc2Cl)c(nn1CC1CCCCC1)-c1cccs1