Reaction Details
TargetEndothelin-1 receptor
LigandBDBM50094000
Substrate/Competitorn/a
Meas. Tech.ChEBML_63349
IC50 1.3±n/a nM
Citation Zhang, JDidierlaurent, SFortin, MLefrançois, DUridat, EVevert, JP Potent nonpeptide endothelin antagonists: synthesis and structure-activity relationships of pyrazole-5-carboxylic acids. Bioorg Med Chem Lett10:2575-8 (2001) Endothelin-1 receptor
Name:Endothelin-1 receptor
Type:Enzyme Catalytic Domain
Mol. Mass.:48256.91
Organism:RAT
Description:ENDOTHELIN A EDNRA RAT::P26684
Residue:426
BDBM50094000
NameBDBM50094000
Synonyms:2-(3-Carboxy-cyclohexylmethyl)-4-(6-chloro-benzo[1,3]dioxol-5-ylmethyl)-5-thiophen-2-yl-2H-pyrazole-3-carboxylic acid | CHEMBL88011
TypeSmall organic molecule
Emp. Form.C24H23ClN2O6S
Mol. Mass.502.967
SMILESOC(=O)C1CCCC(Cn2nc(c(Cc3cc4OCOc4cc3Cl)c2C(O)=O)-c2cccs2)C1