Reaction Details
TargetEndothelin receptor type B
LigandBDBM50094001
Substrate/Competitorn/a
Meas. Tech.ChEBML_64040
IC50 9.7±n/a nM
Citation Zhang, JDidierlaurent, SFortin, MLefrançois, DUridat, EVevert, JP Potent nonpeptide endothelin antagonists: synthesis and structure-activity relationships of pyrazole-5-carboxylic acids. Bioorg Med Chem Lett10:2575-8 (2001) Endothelin receptor type B
Name:Endothelin receptor type B
Type:Enzyme Catalytic Domain
Mol. Mass.:49483.43
Organism:RAT
Description:ENDOTHELIN B EDNRB RAT::P21451
Residue:442
BDBM50094001
NameBDBM50094001
Synonyms:4-(6-Chloro-benzo[1,3]dioxol-5-ylmethyl)-2-(3,5-dimethoxy-benzyl)-5-phenyl-2H-pyrazole-3-carboxylic acid | CHEMBL316187
TypeSmall organic molecule
Emp. Form.C27H23ClN2O6
Mol. Mass.506.934
SMILESCOc1cc(Cn2nc(c(Cc3cc4OCOc4cc3Cl)c2C(O)=O)-c2ccccc2)cc(OC)c1