Reaction Details
TargetAdenosine receptor A3
LigandBDBM50094686
Substrate/Competitorn/a
Meas. Tech.ChEMBL_30034 (CHEMBL641325)
Ki 0.8±n/a nM
Citation Baraldi, PGCacciari, BRomagnoli, RSpalluto, GMoro, SKlotz, KNLeung, EVarani, KGessi, SMerighi, SBorea, PA Pyrazolo[4,3-e]1,2,4-triazolo[1,5-c]pyrimidine derivatives as highly potent and selective human A(3) adenosine receptor antagonists: influence of the chain at the N(8) pyrazole nitrogen. J Med Chem43:4768-80 (2000) Adenosine receptor A3
Name:Adenosine receptor A3
Type:G Protein-Coupled Receptor (GPCR)
Mol. Mass.:36197.32
Organism:Homo sapiens (Human)
Description:P0DMS8
Residue:318
BDBM50094686
NameBDBM50094686
Synonyms:1-(8-tert-Butyl-2-furan-2-yl-8H-pyrazolo[4,3-e][1,2,4]triazolo[1,5-c]pyrimidin-5-yl)-3-(4-methoxy-phenyl)-urea CHEMBL357663
TypeSmall organic molecule
Emp. Form.C22H22N8O3
Mol. Mass.446.4619
SMILESCOc1ccc(NC(=O)Nc2nc3nn(cc3c3nc(nn23)-c2ccco2)C(C)(C)C)cc1