Reaction Details
TargetAdenosine receptor A3
LigandBDBM50094691
Substrate/Competitorn/a
Meas. Tech.ChEMBL_31542 (CHEMBL644493)
IC50 2.7±n/a nM
Citation Baraldi, PGCacciari, BRomagnoli, RSpalluto, GMoro, SKlotz, KNLeung, EVarani, KGessi, SMerighi, SBorea, PA Pyrazolo[4,3-e]1,2,4-triazolo[1,5-c]pyrimidine derivatives as highly potent and selective human A(3) adenosine receptor antagonists: influence of the chain at the N(8) pyrazole nitrogen. J Med Chem43:4768-80 (2000) Adenosine receptor A3
Name:Adenosine receptor A3
Type:G Protein-Coupled Receptor (GPCR)
Mol. Mass.:36197.32
Organism:Homo sapiens (Human)
Description:P0DMS8
Residue:318
BDBM50094691
NameBDBM50094691
Synonyms:1-(2-(furan-2-yl)-8-methyl-8H-pyrazolo[4,3-e][1,2,4]triazolo[1,5-c]pyrimidin-5-yl)-3-(4-methoxyphenyl)urea CHEMBL329791
TypeSmall organic molecule
Emp. Form.C19H16N8O3
Mol. Mass.404.3821
SMILESCOc1ccc(NC(=O)Nc2nc3nn(C)cc3c3nc(nn23)-c2ccco2)cc1