Reaction Details
TargetAdenosine receptor A2b
LigandBDBM50051234
Substrate/Competitorn/a
Meas. Tech.ChEMBL_31224 (CHEMBL641539)
Ki 5.1±n/a nM
Citation Baraldi, PGCacciari, BRomagnoli, RSpalluto, GMoro, SKlotz, KNLeung, EVarani, KGessi, SMerighi, SBorea, PA Pyrazolo[4,3-e]1,2,4-triazolo[1,5-c]pyrimidine derivatives as highly potent and selective human A(3) adenosine receptor antagonists: influence of the chain at the N(8) pyrazole nitrogen. J Med Chem43:4768-80 (2000) Adenosine receptor A2b
Name:Adenosine receptor A2b
Type:G Protein-Coupled Receptor (GPCR)
Mol. Mass.:36341.22
Organism:Homo sapiens (Human)
Description:n/a
Residue:332
BDBM50051234
NameBDBM50051234
Synonyms:2-(furan-2-yl)-8-phenethyl-8H-pyrazolo[4,3-e][1,2,4]triazolo[1,5-c]pyrimidin-5-amine CHEMBL16867 | N-[2-Furan-2-yl-8-(3-phenyl-propyl)-2,8-dihydro-3H-pyrazolo[4,3-e][1,2,4]triazolo[1,5-c]pyrimidin-5-yl]-2-phenoxy-acetamide
TypeSmall organic molecule
Emp. Form.C18H15N7O
Mol. Mass.345.358
SMILESNc1nc2nn(CCc3ccccc3)cc2c2nc(nn12)-c1ccco1