Reaction Details
TargetMetabotropic glutamate receptor 3
LigandBDBM50094842
Substrate/Competitorn/a
Meas. Tech.ChEMBL_106531 (CHEMBL713034)
Ki 41.7±n/a nM
Citation Nakazato, AKumagai, TSakagami, KYoshikawa, RSuzuki, YChaki, SIto, HTaguchi, TNakanishi, SOkuyama, S Synthesis, SARs, and pharmacological characterization of 2-amino-3 or 6-fluorobicyclo[3.1.0]hexane-2,6-dicarboxylic acid derivatives as potent, selective, and orally active group II metabotropic glutamate receptor agonists. J Med Chem43:4893-909 (2000) Metabotropic glutamate receptor 3
Name:Metabotropic glutamate receptor 3
Type:Protein
Mol. Mass.:98971.84
Organism:Rattus norvegicus (Rat)
Description:P31422
Residue:879
BDBM50094842
NameBDBM50094842
Synonyms:(+)-2-Amino-6-fluoro-bicyclo[3.1.0]hexane-2,6-dicarboxylic acid (-)-2-Amino-6-fluoro-bicyclo[3.1.0]hexane-2,6-dicarboxylic acid CHEMBL333519
TypeSmall organic molecule
Emp. Form.C8H10FNO4
Mol. Mass.203.1677
SMILESN[C@]1(CC[C@@H]2[C@H]1[C@@]2(F)C(O)=O)C(O)=O