Reaction Details
TargetSodium-dependent serotonin transporter
LigandBDBM50094930
Substrate/Competitorn/a
Meas. Tech.ChEBML_202000
Ki 0.190000±n/a nM
Citation Gerdes, JMDeFina, SCWilson, PATaylor, SE Serotonin transporter inhibitors: synthesis and binding potency of 2'-methyl- and 3'-methyl-6-nitroquipazine. Bioorg Med Chem Lett10:2643-6 (2000) Sodium-dependent serotonin transporter
Name:Sodium-dependent serotonin transporter
Type:Multi-pass membrane protein
Mol. Mass.:70168.43
Organism:Rattus norvegicus (rat)
Description:P31652
Residue:630
BDBM50094930
NameBDBM50094930
Synonyms:5-Iodo-6-nitro-2-piperazin-1-yl-quinoline | CHEMBL91817
TypeSmall organic molecule
Emp. Form.C13H13IN4O2
Mol. Mass.384.1724
SMILES[O-][N+](=O)c1ccc2nc(ccc2c1I)N1CCNCC1