Reaction Details
Target5-hydroxytryptamine receptor 2C
LigandBDBM50095035
Substrate/Competitorn/a
Meas. Tech.ChEBML_2953
Ki 11±n/a nM
Citation Stevenson, GISmith, ALLewis, SMichie, SGNeduvelil, JGPatel, SMarwood, RPatel, SCastro, JL 2-Aryl tryptamines: selective high-affinity antagonists for the h5-HT2A receptor. Bioorg Med Chem Lett10:2697-9 (2000) 5-hydroxytryptamine receptor 2C
Name:5-hydroxytryptamine receptor 2C
Type:G Protein-Coupled Receptor (GPCR)
Mol. Mass.:51836.79
Organism:Homo sapiens (Human)
Description:P28335
Residue:458
BDBM50095035
NameBDBM50095035
Synonyms:CHEMBL91549 | Ethyl-methyl-[2-(2-phenyl-1H-indol-3-yl)-ethyl]-amine
TypeSmall organic molecule
Emp. Form.C19H22N2
Mol. Mass.278.3914
SMILESCCN(C)CCc1c([nH]c2ccccc12)-c1ccccc1