Reaction Details
Target5-hydroxytryptamine receptor 2A
LigandBDBM50095043
Substrate/Competitorn/a
Meas. Tech.ChEBML_2275
Ki 0.130000±n/a nM
Citation Stevenson, GISmith, ALLewis, SMichie, SGNeduvelil, JGPatel, SMarwood, RPatel, SCastro, JL 2-Aryl tryptamines: selective high-affinity antagonists for the h5-HT2A receptor. Bioorg Med Chem Lett10:2697-9 (2000) 5-hydroxytryptamine receptor 2A
Name:5-hydroxytryptamine receptor 2A
Type:undefined
Mol. Mass.:52607.65
Organism:Homo sapiens (Human)
Description:P28223
Residue:471
BDBM50095043
NameBDBM50095043
Synonyms:CHEMBL90911 | Ethyl-methyl-{2-[2-(3-trifluoromethyl-phenyl)-1H-indol-3-yl]-ethyl}-amine
TypeSmall organic molecule
Emp. Form.C20H21F3N2
Mol. Mass.346.3893
SMILESCCN(C)CCc1c([nH]c2ccccc12)-c1cccc(c1)C(F)(F)F