Reaction Details
Target5-hydroxytryptamine receptor 2C
LigandBDBM50095034
Substrate/Competitorn/a
Meas. Tech.ChEBML_2953
Ki 160±n/a nM
Citation Stevenson, GISmith, ALLewis, SMichie, SGNeduvelil, JGPatel, SMarwood, RPatel, SCastro, JL 2-Aryl tryptamines: selective high-affinity antagonists for the h5-HT2A receptor. Bioorg Med Chem Lett10:2697-9 (2000) 5-hydroxytryptamine receptor 2C
Name:5-hydroxytryptamine receptor 2C
Type:G Protein-Coupled Receptor (GPCR)
Mol. Mass.:51836.79
Organism:Homo sapiens (Human)
Description:P28335
Residue:458
BDBM50095034
NameBDBM50095034
Synonyms:4-{3-[2-(Ethyl-methyl-amino)-ethyl]-1H-indol-2-yl}-benzonitrile | CHEMBL91542
TypeSmall organic molecule
Emp. Form.C20H21N3
Mol. Mass.303.4008
SMILESCCN(C)CCc1c([nH]c2ccccc12)-c1ccc(cc1)C#N