Reaction Details
Target5-hydroxytryptamine receptor 2A
LigandBDBM50095031
Substrate/Competitorn/a
Meas. Tech.ChEBML_2275
Ki 9±n/a nM
Citation Stevenson, GISmith, ALLewis, SMichie, SGNeduvelil, JGPatel, SMarwood, RPatel, SCastro, JL 2-Aryl tryptamines: selective high-affinity antagonists for the h5-HT2A receptor. Bioorg Med Chem Lett10:2697-9 (2000) 5-hydroxytryptamine receptor 2A
Name:5-hydroxytryptamine receptor 2A
Type:undefined
Mol. Mass.:52607.65
Organism:Homo sapiens (Human)
Description:P28223
Residue:471
BDBM50095031
NameBDBM50095031
Synonyms:2-Phenyl-3-(2-pyrrolidin-1-yl-ethyl)-1H-indole | CHEMBL90347
TypeSmall organic molecule
Emp. Form.C20H22N2
Mol. Mass.290.4021
SMILESC(Cc1c([nH]c2ccccc12)-c1ccccc1)N1CCCC1