Reaction Details
Target5-hydroxytryptamine receptor 2C
LigandBDBM50095036
Substrate/Competitorn/a
Meas. Tech.ChEBML_2953
Ki 15±n/a nM
Citation Stevenson, GISmith, ALLewis, SMichie, SGNeduvelil, JGPatel, SMarwood, RPatel, SCastro, JL 2-Aryl tryptamines: selective high-affinity antagonists for the h5-HT2A receptor. Bioorg Med Chem Lett10:2697-9 (2000) 5-hydroxytryptamine receptor 2C
Name:5-hydroxytryptamine receptor 2C
Type:G Protein-Coupled Receptor (GPCR)
Mol. Mass.:51836.79
Organism:Homo sapiens (Human)
Description:P28335
Residue:458
BDBM50095036
NameBDBM50095036
Synonyms:CHEMBL330303 | {2-[2-(3,5-Bis-trifluoromethyl-phenyl)-1H-indol-3-yl]-ethyl}-ethyl-methyl-amine
TypeSmall organic molecule
Emp. Form.C21H20F6N2
Mol. Mass.414.3873
SMILESCCN(C)CCc1c([nH]c2ccccc12)-c1cc(cc(c1)C(F)(F)F)C(F)(F)F