Reaction Details
Target5-hydroxytryptamine receptor 2A
LigandBDBM50095047
Substrate/Competitorn/a
Meas. Tech.ChEBML_2275
Ki 4±n/a nM
Citation Stevenson, GISmith, ALLewis, SMichie, SGNeduvelil, JGPatel, SMarwood, RPatel, SCastro, JL 2-Aryl tryptamines: selective high-affinity antagonists for the h5-HT2A receptor. Bioorg Med Chem Lett10:2697-9 (2000) 5-hydroxytryptamine receptor 2A
Name:5-hydroxytryptamine receptor 2A
Type:undefined
Mol. Mass.:52607.65
Organism:Homo sapiens (Human)
Description:P28223
Residue:471
BDBM50095047
NameBDBM50095047
Synonyms:3-[2-((S)-2-Methyl-piperidin-1-yl)-ethyl]-2-phenyl-1H-indole | CHEMBL90739
TypeSmall organic molecule
Emp. Form.C22H26N2
Mol. Mass.318.4552
SMILESC[C@H]1CCCCN1CCc1c([nH]c2ccccc12)-c1ccccc1