Reaction Details
Target5-hydroxytryptamine receptor 2A
LigandBDBM50095049
Substrate/Competitorn/a
Meas. Tech.ChEBML_2311
Ki 0.500000±n/a nM
Citation Crawforth, JGoodacre, SMaxey, RBourrain, SPatel, SMarwood, RO'Connor, DHerbert, RHutson, PRowley, M 3-(4-Piperidinyl)- and 3-(8-aza-bicyclo[3.2.1]oct-3-yl)-2-phenyl-1H-indoles as bioavailable h5-HT2A antagonists. Bioorg Med Chem Lett10:2701-3 (2000) 5-hydroxytryptamine receptor 2A
Name:5-hydroxytryptamine receptor 2A
Type:undefined
Mol. Mass.:52607.65
Organism:Homo sapiens (Human)
Description:P28223
Residue:471
BDBM50095049
NameBDBM50095049
Synonyms:3-(1-Phenethyl-piperidin-4-yl)-2-phenyl-1H-indole CHEMBL40584
TypeSmall organic molecule
Emp. Form.C27H28N2
Mol. Mass.380.5246
SMILESC(Cc1ccccc1)N1CCC(CC1)c1c([nH]c2ccccc12)-c1ccccc1