Reaction Details
TargetKelch-like ECH-associated protein 1
LigandBDBM50539551
Substrate/Competitorn/a
Meas. Tech.ChEMBL_1978290 (CHEMBL4611425)
Kd 0.880000±n/a nM
Citation Ma, BLucas, BCapacci, ALin, EYJones, JHDechantsreiter, MEnyedy, IMarcotte, DXiao, GLi, BRichter, K Design, synthesis and identification of novel, orally bioavailable non-covalent Nrf2 activators. Bioorg Med Chem Lett30:0 (2020) 
 
Kelch-like ECH-associated protein 1
Name:Kelch-like ECH-associated protein 1
Type:PROTEIN
Mol. Mass.:69664.53
Organism:Homo sapiens (Human)
Description:ChEMBL_107924
Residue:624
BDBM50539551
NameBDBM50539551
Synonyms:CHEMBL4633657
TypeSmall organic molecule
Emp. Form.C34H40N4O3
Mol. Mass.552.7064
SMILESCC[C@@H]([C@@H](c1ccc2CCN(Cc2c1)C(=O)c1c(C)c(C)cc(C)c1C)c1ccc2n(CC)nnc2c1C)C(O)=O