Reaction Details
TargetKelch-like ECH-associated protein 1
LigandBDBM50539562
Substrate/Competitorn/a
Meas. Tech.ChEMBL_1978290 (CHEMBL4611425)
Kd 2.7±n/a nM
Citation Ma, BLucas, BCapacci, ALin, EYJones, JHDechantsreiter, MEnyedy, IMarcotte, DXiao, GLi, BRichter, K Design, synthesis and identification of novel, orally bioavailable non-covalent Nrf2 activators. Bioorg Med Chem Lett30:0 (2020) 
 
Kelch-like ECH-associated protein 1
Name:Kelch-like ECH-associated protein 1
Type:PROTEIN
Mol. Mass.:69664.53
Organism:Homo sapiens (Human)
Description:ChEMBL_107924
Residue:624
BDBM50539562
NameBDBM50539562
Synonyms:CHEMBL4642419
TypeSmall organic molecule
Emp. Form.C28H28N4O3
Mol. Mass.468.5469
SMILESCCn1nnc2c(C)c(ccc12)[C@@H](CC(O)=O)c1ccc2CCN(Cc2c1)C(=O)c1ccccc1