Reaction Details
TargetIntegrase
LigandBDBM50095504
Substrate/Competitorn/a
Meas. Tech.ChEMBL_90549 (CHEMBL701899)
IC50 250±n/a nM
Citation Wai, JSEgbertson, MSPayne, LSFisher, TEEmbrey, MWTran, LOMelamed, JYLangford, HMGuare, JPZhuang, LGrey, VEVacca, JPHolloway, MKNaylor-Olsen, AMHazuda, DJFelock, PJWolfe, ALStillmock, KASchleif, WAGabryelski, LJYoung, SD 4-Aryl-2,4-dioxobutanoic acid inhibitors of HIV-1 integrase and viral replication in cells. J Med Chem43:4923-6 (2001) Integrase
Name:Integrase
Synonyms:Human immunodeficiency virus type 1 integrase
Type:PROTEIN
Mol. Mass.:32231.48
Organism:Human immunodeficiency virus 1
Description:ChEMBL_90865
Residue:288
BDBM50095504
NameBDBM50095504
TypeSmall organic molecule
Emp. Form.C17H13FO4
Mol. Mass.300.2811
SMILESOC(=O)C(=O)CC(=O)c1cccc(Cc2cccc(F)c2)c1