Reaction Details
TargetNeutrophil elastase
LigandBDBM50095530
Substrate/Competitorn/a
Meas. Tech.ChEMBL_88197 (CHEMBL699807)
Ki 0.52±n/a nM
Citation Ohmoto, KYamamoto, THoriuchi, TImanishi, HOdagaki, YKawabata, KSekioka, THirota, YMatsuoka, SNakai, HToda, MCheronis, JCSpruce, LWGyorkos, AWieczorek, M Design and synthesis of new orally active nonpeptidic inhibitors of human neutrophil elastase. J Med Chem43:4927-9 (2001) Neutrophil elastase
Name:Neutrophil elastase
Type:Enzyme
Mol. Mass.:28532.38
Organism:Homo sapiens (Human)
Description:P08246
Residue:267
BDBM50095530
NameBDBM50095530
Synonyms:(S)-2-(5-amino-2-(4-fluorophenyl)-6-oxopyrimidin-1(6H)-yl)-N-(3-methyl-1-oxo-1-(5-(2-phenylpropan-2-yl)-1,3,4-oxadiazol-2-yl)butan-2-yl)acetamide 2-[5-Amino-2-(4-fluoro-phenyl)-6-oxo-6H-pyrimidin-1-yl]-N-{2-methyl-1-[5-(1-methyl-1-phenyl-ethyl)-[1,3,4]oxadiazole-2-carbonyl]-propyl}-acetamide | CHEMBL277672
TypeSmall organic molecule
Emp. Form.C28H29FN6O4
Mol. Mass.532.5661
SMILESCC(C)[C@H](NC(=O)Cn1c(ncc(N)c1=O)-c1ccc(F)cc1)C(=O)c1nnc(o1)C(C)(C)c1ccccc1