Reaction Details
TargetNeuronal acetylcholine receptor subunit alpha-4
LigandBDBM50095649
Substrate/Competitorn/a
Meas. Tech.ChEMBL_142763 (CHEMBL750485)
Ki 4.4±n/a nM
Citation Kagabu, SMaienfisch, PZhang, AGranda-Minones, JHaettenschwiler, JKayser, HMaetzke, TCasida, JE 5-Azidoimidacloprid and an acyclic analogue as candidate photoaffinity probes for mammalian and insect nicotinic acetylcholine receptors. J Med Chem43:5003-9 (2001) Neuronal acetylcholine receptor subunit alpha-4
Name:Neuronal acetylcholine receptor subunit alpha-4
Type:Enzyme
Mol. Mass.:70196.44
Organism:Rattus norvegicus (Rat)
Description:P09483
Residue:630
BDBM50095649
NameBDBM50095649
Synonyms:(2E)-1-[(5-azido-6-chloropyridin-3-yl)methyl]-N-nitroimidazolidin-2-imine | CHEMBL97343
TypeSmall organic molecule
Emp. Form.C9H9ClN8O2
Mol. Mass.296.673
SMILES[O-][N+](=O)N=C1NCCN1Cc1cnc(Cl)c(c1)N=[N+]=[N-]