Reaction Details
TargetDelta-type opioid receptor
LigandBDBM50095733
Substrate/Competitorn/a
Meas. Tech.ChEMBL_145765 (CHEMBL752783)
IC50 35±n/a nM
Citation Maeda, DYBerman, FMurray, TFAldrich, JV Synthesis and evaluation of isothiocyanate-containing derivatives of the delta-opioid receptor antagonist Tyr-Tic-Phe-Phe (TIPP) as potential affinity labels for delta-opioid receptors. J Med Chem43:5044-9 (2001) Delta-type opioid receptor
Name:Delta-type opioid receptor
Type:Enzyme Catalytic Domain
Mol. Mass.:40577.25
Organism:MOUSE
Description:P32300
Residue:372
BDBM50095733
NameBDBM50095733
Synonyms:2-[2-(2-{2-[2-Dibenzylamino-3-(4-hydroxy-phenyl)-propionylamino]-acetylamino}-acetylamino)-3-(4-isothiocyanato-phenyl)-propionylamino]-4-methyl-pentanoic acid | CHEMBL146354
TypeSmall organic molecule
Emp. Form.C43H48N6O7S
Mol. Mass.792.942
SMILESCC(C)CC(NC(=O)C(Cc1ccc(cc1)N=C=S)NC(=O)CNC(=O)CNC(=O)C(Cc1ccc(O)cc1)N(Cc1ccccc1)Cc1ccccc1)C(O)=O