Reaction Details
TargetReverse transcriptase/RNaseH
LigandBDBM50095772
Substrate/Competitorn/a
Meas. Tech.ChEMBL_195341 (CHEMBL802583)
IC50 110±n/a nM
Citation Rizzo, RCTirado-Rives, JJorgensen, WL Estimation of binding affinities for HEPT and nevirapine analogues with HIV-1 reverse transcriptase via Monte Carlo simulations. J Med Chem44:145-54 (2001) Reverse transcriptase/RNaseH
Name:Reverse transcriptase/RNaseH
Type:PROTEIN
Mol. Mass.:65229.15
Organism:Human immunodeficiency virus 1
Description:ChEMBL_1473730
Residue:566
BDBM50095772
NameBDBM50095772
Synonyms:5,9-Diethyl-10-methyl-5,10-dihydro-4,5,6,10-tetraaza-dibenzo[a,d]cyclohepten-11-one | CHEMBL39792
TypeSmall organic molecule
Emp. Form.C16H18N4O
Mol. Mass.282.3403
SMILESCCN1c2ncccc2C(=O)N(C)c2c(CC)ccnc12