Reaction Details
TargetReverse transcriptase/RNaseH
LigandBDBM50004124
Substrate/Competitorn/a
Meas. Tech.ChEMBL_197277 (CHEMBL804264)
EC50 5.9±n/a nM
Citation Rizzo, RCTirado-Rives, JJorgensen, WL Estimation of binding affinities for HEPT and nevirapine analogues with HIV-1 reverse transcriptase via Monte Carlo simulations. J Med Chem44:145-54 (2001) Reverse transcriptase/RNaseH
Name:Reverse transcriptase/RNaseH
Type:PROTEIN
Mol. Mass.:65229.15
Organism:Human immunodeficiency virus 1
Description:ChEMBL_1473730
Residue:566
BDBM50004124
NameBDBM50004124
Synonyms:1-Benzyloxymethyl-5-ethyl-6-phenylsulfanyl-1H-pyrimidine-2,4-dione | CHEMBL288688
TypeSmall organic molecule
Emp. Form.C20H20N2O3S
Mol. Mass.368.449
SMILESCCc1c(Sc2ccccc2)n(COCc2ccccc2)c(=O)[nH]c1=O