Reaction Details
TargetReverse transcriptase/RNaseH
LigandBDBM1517
Substrate/Competitorn/a
Meas. Tech.ChEMBL_195341 (CHEMBL802583)
IC50 35±n/a nM
Citation Rizzo, RCTirado-Rives, JJorgensen, WL Estimation of binding affinities for HEPT and nevirapine analogues with HIV-1 reverse transcriptase via Monte Carlo simulations. J Med Chem44:145-54 (2001) Reverse transcriptase/RNaseH
Name:Reverse transcriptase/RNaseH
Type:PROTEIN
Mol. Mass.:65229.15
Organism:Human immunodeficiency virus 1
Description:ChEMBL_1473730
Residue:566
BDBM1517
NameBDBM1517
Synonyms:2-ethyl-7-methyl-2,4,9,15-tetraazatricyclo[9.4.0.0^{3,8}]pentadeca-1(11),3,5,7,12,14-hexaen-10-one Dipyridodiazepinone deriv. 2
TypeSmall organic molecule
Emp. Form.C14H14N4O
Mol. Mass.254.2872
SMILESCCN1c2nccc(C)c2NC(=O)c2cccnc12