Reaction Details
TargetAdenosine receptor A2b
LigandBDBM50095786
Substrate/Competitorn/a
Meas. Tech.ChEMBL_30303 (CHEMBL639472)
IC50 14±n/a nM
Citation Harada, HAsano, OHoshino, YYoshikawa, SMatsukura, MKabasawa, YNiijima, JKotake, YWatanabe, NKawata, TInoue, THorizoe, TYasuda, NMinami, HNagata, KMurakami, MNagaoka, JKobayashi, STanaka, IAbe, S 2-Alkynyl-8-aryl-9-methyladenines as novel adenosine receptor antagonists: their synthesis and structure-activity relationships toward hepatic glucose production induced via agonism of the A(2B) receptor. J Med Chem44:170-9 (2001) Adenosine receptor A2b
Name:Adenosine receptor A2b
Type:G Protein-Coupled Receptor (GPCR)
Mol. Mass.:36341.22
Organism:Homo sapiens (Human)
Description:n/a
Residue:332
BDBM50095786
NameBDBM50095786
Synonyms:1-(6-Amino-8-furan-2-yl-9-methyl-9H-purin-2-ylethynyl)-cyclohexanol | CHEMBL50051
TypeSmall organic molecule
Emp. Form.C18H19N5O2
Mol. Mass.337.3758
SMILESCn1c(nc2c(N)nc(nc12)C#CC1(O)CCCCC1)-c1ccco1