Reaction Details
TargetAdenosine receptor A2a
LigandBDBM50095778
Substrate/Competitorn/a
Meas. Tech.ChEMBL_31349 (CHEMBL641570)
Ki 9.1±n/a nM
Citation Harada, HAsano, OHoshino, YYoshikawa, SMatsukura, MKabasawa, YNiijima, JKotake, YWatanabe, NKawata, TInoue, THorizoe, TYasuda, NMinami, HNagata, KMurakami, MNagaoka, JKobayashi, STanaka, IAbe, S 2-Alkynyl-8-aryl-9-methyladenines as novel adenosine receptor antagonists: their synthesis and structure-activity relationships toward hepatic glucose production induced via agonism of the A(2B) receptor. J Med Chem44:170-9 (2001) Adenosine receptor A2a
Name:Adenosine receptor A2a
Type:G Protein-Coupled Receptor (GPCR)
Mol. Mass.:44716.46
Organism:Homo sapiens (Human)
Description:P29274
Residue:412
BDBM50095778
NameBDBM50095778
Synonyms:4-[6-Amino-8-(3-fluoro-phenyl)-9-methyl-9H-purin-2-yl]-2-methyl-but-3-yn-2-ol | CHEMBL300624
TypeSmall organic molecule
Emp. Form.C17H16FN5O
Mol. Mass.325.3402
SMILESCn1c(nc2c(N)nc(nc12)C#CC(C)(C)O)-c1cccc(F)c1