Reaction Details
TargetAdenosine receptor A3
LigandBDBM50059376
Substrate/Competitorn/a
Meas. Tech.ChEMBL_31853 (CHEMBL643930)
Ki 13±n/a nM
Citation Harada, HAsano, OHoshino, YYoshikawa, SMatsukura, MKabasawa, YNiijima, JKotake, YWatanabe, NKawata, TInoue, THorizoe, TYasuda, NMinami, HNagata, KMurakami, MNagaoka, JKobayashi, STanaka, IAbe, S 2-Alkynyl-8-aryl-9-methyladenines as novel adenosine receptor antagonists: their synthesis and structure-activity relationships toward hepatic glucose production induced via agonism of the A(2B) receptor. J Med Chem44:170-9 (2001) Adenosine receptor A3
Name:Adenosine receptor A3
Type:G Protein-Coupled Receptor (GPCR)
Mol. Mass.:36197.32
Organism:Homo sapiens (Human)
Description:P0DMS8
Residue:318
BDBM50059376
NameBDBM50059376
Synonyms:9-Methyl-2-phenyl-5,9-dihydro-[1,2,4]triazolo[5,1-a][2,7]naphthyridine-6-carboxylic acid methyl ester L-249313
TypeSmall organic molecule
Emp. Form.C18H16N4O2
Mol. Mass.320.3452
SMILESCOC(=O)C1=C2C=CN(C)C=C2c2nc(nn2C1)-c1ccccc1