Reaction Details
TargetBromodomain-containing protein 4
LigandBDBM50539801
Substrate/Competitorn/a
Meas. Tech.ChEMBL_1979342 (CHEMBL4612477)
IC50 1.7±n/a nM
Citation Li, YZhao, JGutgesell, LMShen, ZRatia, KDye, KDubrovskyi, OZhao, HHuang, FTonetti, DAThatcher, GRJXiong, R Novel Pyrrolopyridone Bromodomain and Extra-Terminal Motif (BET) Inhibitors Effective in Endocrine-Resistant ER+ Breast Cancer with Acquired Resistance to Fulvestrant and Palbociclib. J Med Chem63:7186-7210 (2020) 
 
Bromodomain-containing protein 4
Name:Bromodomain-containing protein 4
Type:Protein
Mol. Mass.:152264.84
Organism:Homo sapiens (Human)
Description:O60885
Residue:1362
BDBM50539801
NameBDBM50539801
Synonyms:CHEMBL4648912 | US11840533, Compound 70
TypeSmall organic molecule
Emp. Form.C30H28N6O3S
Mol. Mass.552.647
SMILESCCS(=O)(=O)Nc1cc(cc2n(ccc12)C(C)(c1ccccn1)c1ccccn1)-c1cn(C)c2c1cc[nH]c2=O