Reaction Details
TargetBromodomain and WD repeat-containing protein 1
LigandBDBM50539801
Substrate/Competitorn/a
Meas. Tech.ChEMBL_1979383 (CHEMBL4612518)
Kd<1.000000±n/a nM
Citation Li, YZhao, JGutgesell, LMShen, ZRatia, KDye, KDubrovskyi, OZhao, HHuang, FTonetti, DAThatcher, GRJXiong, R Novel Pyrrolopyridone Bromodomain and Extra-Terminal Motif (BET) Inhibitors Effective in Endocrine-Resistant ER+ Breast Cancer with Acquired Resistance to Fulvestrant and Palbociclib. J Med Chem63:7186-7210 (2020) 
 
Bromodomain and WD repeat-containing protein 1
Name:Bromodomain and WD repeat-containing protein 1
Type:PROTEIN
Mol. Mass.:262994.15
Organism:Homo sapiens (Human)
Description:ChEMBL_109516
Residue:2320
BDBM50539801
NameBDBM50539801
Synonyms:CHEMBL4648912 | US11840533, Compound 70
TypeSmall organic molecule
Emp. Form.C30H28N6O3S
Mol. Mass.552.647
SMILESCCS(=O)(=O)Nc1cc(cc2n(ccc12)C(C)(c1ccccn1)c1ccccn1)-c1cn(C)c2c1cc[nH]c2=O