Reaction Details
TargetGlucocorticoid receptor
LigandBDBM50096153
Substrate/Competitorn/a
Meas. Tech.ChEMBL_71094 (CHEMBL678545)
IC50 6.4±n/a nM
Citation Procopiou, PABiggadike, KEnglish, AFFarrell, RMHagger, GNHancock, APHaase, MVIrving, WRSareen, MSnowden, MASolanke, YETralau-Stewart, CJWalton, SEWood, JA Novel glucocorticoid antedrugs possessing a 17beta-(gamma-lactone) ring. J Med Chem44:602-12 (2001) Glucocorticoid receptor
Name:Glucocorticoid receptor
Type:Enzyme
Mol. Mass.:85656.87
Organism:Homo sapiens (Human)
Description:P04150
Residue:777
BDBM50096153
NameBDBM50096153
Synonyms:4b,12-Difluoro-5-hydroxy-4a,6a-dimethyl-6b-(2-oxo-tetrahydro-furan-3-ylsulfanyl)-8-propyl-3,4,4a,4b,5,6,6a,6b,9a,10,10a,10b,11,12-tetradecahydro-7,9-dioxa-pentaleno[2,1-a]phenanthren-2-one | CHEMBL414449
TypeSmall organic molecule
Emp. Form.C27H36F2O6S
Mol. Mass.526.633
SMILESCCC[C@@H]1O[C@@H]2CC3C4C[C@H](F)C5=CC(=O)CC[C@]5(C)[C@@]4(F)[C@@H](O)C[C@]3(C)[C@@]2(O1)S[C@@H]1CCOC1=O