Reaction Details
TargetAMP deaminase 3
LigandBDBM50096158
Substrate/Competitorn/a
Meas. Tech.ChEMBL_31886 (CHEMBL645676)
Ki 14000±n/a nM
Citation Kasibhatla, SRBookser, BCXiao, WErion, MD AMP deaminase inhibitors. 5. Design, synthesis, and SAR of a highly potent inhibitor series. J Med Chem44:613-8 (2001) AMP deaminase 3
Name:AMP deaminase 3
Type:Protein
Mol. Mass.:88818.80
Organism:Homo sapiens (Human)
Description:n/a
Residue:767
BDBM50096158
NameBDBM50096158
Synonyms:6-Bromo-4-[2-(8-hydroxy-7,8-dihydro-6H-imidazo[4,5-d][1,3]diazepin-3-yl)-ethyl]-naphthalene-2-carboxylic acid ethyl ester | CHEMBL348608
TypeSmall organic molecule
Emp. Form.C21H21BrN4O3
Mol. Mass.457.32
SMILESCCOC(=O)c1cc(CCn2cnc3C(O)CNC=Nc23)c2cc(Br)ccc2c1