Reaction Details
TargetAMP deaminase 3
LigandBDBM50096163
Substrate/Competitorn/a
Meas. Tech.ChEMBL_31886 (CHEMBL645676)
Ki 2300±n/a nM
Citation Kasibhatla, SRBookser, BCXiao, WErion, MD AMP deaminase inhibitors. 5. Design, synthesis, and SAR of a highly potent inhibitor series. J Med Chem44:613-8 (2001) AMP deaminase 3
Name:AMP deaminase 3
Type:Protein
Mol. Mass.:88818.80
Organism:Homo sapiens (Human)
Description:n/a
Residue:767
BDBM50096163
NameBDBM50096163
Synonyms:4-[2-(8-Hydroxy-7,8-dihydro-6H-imidazo[4,5-d][1,3]diazepin-3-yl)-ethyl]-1-methoxy-5,6,7,8-tetrahydro-naphthalene-2-carboxylic acid ethyl ester | CHEMBL157800
TypeSmall organic molecule
Emp. Form.C22H28N4O4
Mol. Mass.412.4821
SMILESCCOC(=O)c1cc(CCn2cnc3C(O)CNC=Nc23)c2CCCCc2c1OC