Reaction Details
TargetAMP deaminase 3
LigandBDBM50087332
Substrate/Competitorn/a
Meas. Tech.ChEMBL_31886 (CHEMBL645676)
Ki 410±n/a nM
Citation Kasibhatla, SRBookser, BCXiao, WErion, MD AMP deaminase inhibitors. 5. Design, synthesis, and SAR of a highly potent inhibitor series. J Med Chem44:613-8 (2001) AMP deaminase 3
Name:AMP deaminase 3
Type:Protein
Mol. Mass.:88818.80
Organism:Homo sapiens (Human)
Description:n/a
Residue:767
BDBM50087332
NameBDBM50087332
Synonyms:2-Benzyl-6-(8-hydroxy-7,8-dihydro-6H-imidazo[4,5-d][1,3]diazepin-3-yl)-hexanoic acid CHEMBL35929
TypeSmall organic molecule
Emp. Form.C19H24N4O3
Mol. Mass.356.4189
SMILESOC1CNC=Nc2c1ncn2CCCCC(Cc1ccccc1)C(O)=O