Reaction Details
TargetAdenosine deaminase
LigandBDBM50096165
Substrate/Competitorn/a
Meas. Tech.ChEMBL_30808 (CHEMBL645083)
Ki>7500±n/a nM
Citation Kasibhatla, SRBookser, BCXiao, WErion, MD AMP deaminase inhibitors. 5. Design, synthesis, and SAR of a highly potent inhibitor series. J Med Chem44:613-8 (2001) Adenosine deaminase
Name:Adenosine deaminase
Type:Enzyme
Mol. Mass.:40910.44
Organism:Bos taurus (bovine)
Description:n/a
Residue:363
BDBM50096165
NameBDBM50096165
Synonyms:4-[2-(8-Hydroxy-7,8-dihydro-6H-imidazo[4,5-d][1,3]diazepin-3-yl)-ethyl]-5,6,7,8-tetrahydro-naphthalene-2-carboxylic acid | CHEMBL157949
TypeSmall organic molecule
Emp. Form.C19H22N4O3
Mol. Mass.354.403
SMILESOC1CNC=Nc2c1ncn2CCc1cc(cc2CCCCc12)C(O)=O