Reaction Details
TargetAMP deaminase 3
LigandBDBM50096164
Substrate/Competitorn/a
Meas. Tech.ChEMBL_31886 (CHEMBL645676)
Ki 50±n/a nM
Citation Kasibhatla, SRBookser, BCXiao, WErion, MD AMP deaminase inhibitors. 5. Design, synthesis, and SAR of a highly potent inhibitor series. J Med Chem44:613-8 (2001) AMP deaminase 3
Name:AMP deaminase 3
Type:Protein
Mol. Mass.:88818.80
Organism:Homo sapiens (Human)
Description:n/a
Residue:767
BDBM50096164
NameBDBM50096164
Synonyms:1,3-Dichloro-4-[2-(8-hydroxy-7,8-dihydro-6H-imidazo[4,5-d][1,3]diazepin-3-yl)-ethyl]-5,6,7,8-tetrahydro-naphthalene-2-carboxylic acid | CHEMBL280097
TypeSmall organic molecule
Emp. Form.C19H20Cl2N4O3
Mol. Mass.423.293
SMILESOC1CNC=Nc2c1ncn2CCc1c(Cl)c(C(O)=O)c(Cl)c2CCCCc12