Reaction Details
TargetDelta-type opioid receptor
LigandBDBM50370067
Substrate/Competitorn/a
Meas. Tech.ChEMBL_1982399 (CHEMBL4615661)
Ki 0.830000±n/a nM
Citation Pasquinucci, LParenti, CRuiz-Cantero, MCGeorgoussi, ZPallaki, PCobos, EJAmata, EMarrazzo, APrezzavento, OArena, EDichiara, MSalerno, LTurnaturi, R Novel  ACS Med Chem Lett11:678-685 (2020) 
 
Delta-type opioid receptor
Name:Delta-type opioid receptor
Type:G Protein-Coupled Receptor (GPCR)
Mol. Mass.:40465.04
Organism:Rattus norvegicus (rat)
Description:Competition binding assays were using CHO-K1 cell membranes expressing the opioid receptor.
Residue:372
BDBM50370067
NameBDBM50370067
Synonyms:CHEMBL1237164
TypeSmall organic molecule
Emp. Form.C26H26N2O3
Mol. Mass.414.4962
SMILESOc1ccc2C[C@H]3N(CC4CC4)CC[C@@]45[C@@H](Oc1c24)c1[nH]c2ccccc2c1C[C@@]35O