Reaction Details
TargetReverse transcriptase/RNaseH
LigandBDBM1944
Substrate/Competitorn/a
Meas. Tech.ChEMBL_140631 (CHEMBL752876)
IC50 50000±n/a nM
Citation Venkatachalam, TKSudbeck, EAMao, CUckun, FM Anti-HIV activity of aromatic and heterocyclic thiazolyl thiourea compounds. Bioorg Med Chem Lett11:523-8 (2001) Reverse transcriptase/RNaseH
Name:Reverse transcriptase/RNaseH
Type:PROTEIN
Mol. Mass.:65229.15
Organism:Human immunodeficiency virus 1
Description:ChEMBL_1473730
Residue:566
BDBM1944
NameBDBM1944
Synonyms:BHAP deriv. DELAVIRDINE MESYLATE N-[2-({4-[3-(propan-2-ylamino)pyridin-2-yl]piperazin-1-yl}carbonyl)-1H-indol-5-yl]methanesulfonamide U-90152S
TypeSmall organic molecule
Emp. Form.C22H28N6O3S
Mol. Mass.456.561
SMILESCC(C)Nc1cccnc1N1CCN(CC1)C(=O)c1cc2cc(NS(C)(=O)=O)ccc2[nH]1