Reaction Details
TargetReverse transcriptase/RNaseH
LigandBDBM50097049
Substrate/Competitorn/a
Meas. Tech.ChEBML_140627
IC50>100000±n/a nM
Citation Venkatachalam, TKSudbeck, EAMao, CUckun, FM Anti-HIV activity of aromatic and heterocyclic thiazolyl thiourea compounds. Bioorg Med Chem Lett11:523-8 (2001) Reverse transcriptase/RNaseH
Name:Reverse transcriptase/RNaseH
Type:PROTEIN
Mol. Mass.:65229.15
Organism:Human immunodeficiency virus 1
Description:ChEMBL_1473730
Residue:566
BDBM50097049
NameBDBM50097049
Synonyms:1-(3-Imidazol-1-yl-propyl)-3-thiazol-2-yl-thiourea | CHEMBL358280
TypeSmall organic molecule
Emp. Form.C10H13N5S2
Mol. Mass.267.374
SMILESS=C(NCCCn1ccnc1)Nc1nccs1