Reaction Details
TargetEndothelin receptor type B
LigandBDBM50097182
Substrate/Competitorn/a
Meas. Tech.ChEBML_63862
IC50 470±n/a nM
Citation Dasgupta, FGangadhar, NBruhaspathy, MVerma, AKSarin, SMukherjee, AK Peptoids as endothelin receptor antagonists. Bioorg Med Chem Lett11:555-7 (2001) Endothelin receptor type B
Name:Endothelin receptor type B
Type:PROTEIN
Mol. Mass.:49616.89
Organism:Sus scrofa
Description:ChEMBL_63872
Residue:443
BDBM50097182
NameBDBM50097182
Synonyms:2-[((E)-3-Benzo[1,3]dioxol-5-yl-acryloyl)-(4-methoxy-benzyl)-amino]-3-(1H-indol-3-yl)-propionic acid | CHEMBL356916
TypeSmall organic molecule
Emp. Form.C29H26N2O6
Mol. Mass.498.5265
SMILESCOc1ccc(CN(C(Cc2c[nH]c3ccccc23)C(O)=O)C(=O)\C=C\c2ccc3OCOc3c2)cc1