Reaction Details
Target5-hydroxytryptamine receptor 2A
LigandBDBM50097222
Substrate/Competitorn/a
Meas. Tech.ChEBML_2615
Ki 9±n/a nM
Citation Westkaemper, RBRunyon, SPSavage, JERoth, BLGlennon, RA Exploring the relationship between binding modes of 9-(aminomethyl)-9,10-dihydroanthracene and cyproheptadine analogues at the 5-HT2A serotonin receptor. Bioorg Med Chem Lett11:563-6 (2001) 5-hydroxytryptamine receptor 2A
Name:5-hydroxytryptamine receptor 2A
Type:G Protein-Coupled Receptor (GPCR)
Mol. Mass.:52852.05
Organism:Rattus norvegicus (rat)
Description:Rat cortex membranes 5-HT2A receptors.
Residue:471
BDBM50097222
NameBDBM50097222
Synonyms:4-(10,11-Dihydro-dibenzo[a,d]cyclohepten-5-ylidene)-1-methyl-piperidine | CHEMBL152622
TypeSmall organic molecule
Emp. Form.C21H23N
Mol. Mass.289.414
SMILES[#6]-[#7]-1-[#6]-[#6]\[#6](-[#6]-[#6]-1)=[#6]-1/c2ccccc2-[#6]-[#6]-c2ccccc-12