Reaction Details
TargetStromelysin-1
LigandBDBM50097270
Substrate/Competitorn/a
Meas. Tech.ChEBML_104580
IC50 2.6±n/a nM
Citation Fray, MJDickinson, RP Discovery of potent and selective succinyl hydroxamate inhibitors of matrix metalloprotease-3 (stromelysin-1). Bioorg Med Chem Lett11:571-4 (2001) Stromelysin-1
Name:Stromelysin-1
Type:Enzyme
Mol. Mass.:53973.13
Organism:Homo sapiens (Human)
Description: P08254
Residue:477
BDBM50097270
NameBDBM50097270
Synonyms:(R)-2-(3-Biphenyl-4-yl-propyl)-N*1*-[(S)-2,2-dimethyl-1-((R)-1-phenyl-ethylcarbamoyl)-propyl]-N*4*-hydroxy-succinamide | CHEMBL345447
TypeSmall organic molecule
Emp. Form.C33H41N3O4
Mol. Mass.543.6963
SMILESC[C@@H](NC(=O)[C@@H](NC(=O)[C@H](CCCc1ccc(cc1)-c1ccccc1)CC(=O)NO)C(C)(C)C)c1ccccc1