Reaction Details
Target72 kDa type IV collagenase
LigandBDBM50097272
Substrate/Competitorn/a
Meas. Tech.ChEBML_106807
IC50 335±n/a nM
Citation Fray, MJDickinson, RP Discovery of potent and selective succinyl hydroxamate inhibitors of matrix metalloprotease-3 (stromelysin-1). Bioorg Med Chem Lett11:571-4 (2001) 72 kDa type IV collagenase
Name:72 kDa type IV collagenase
Type:Enzyme
Mol. Mass.:73870.36
Organism:Homo sapiens (Human)
Description: P08253
Residue:660
BDBM50097272
NameBDBM50097272
Synonyms:(R)-N*1*-[(S)-2,2-Dimethyl-1-((R)-1-phenyl-ethylcarbamoyl)-propyl]-2-[3-(2-fluoro-biphenyl-4-yl)-propyl]-N*4*-hydroxy-succinamide | CHEMBL152277
TypeSmall organic molecule
Emp. Form.C33H40FN3O4
Mol. Mass.561.6868
SMILESC[C@@H](NC(=O)[C@@H](NC(=O)[C@H](CCCc1ccc(c(F)c1)-c1ccccc1)CC(=O)NO)C(C)(C)C)c1ccccc1