Reaction Details
Target72 kDa type IV collagenase
LigandBDBM50097252
Substrate/Competitorn/a
Meas. Tech.ChEBML_106807
IC50 61±n/a nM
Citation Fray, MJDickinson, RP Discovery of potent and selective succinyl hydroxamate inhibitors of matrix metalloprotease-3 (stromelysin-1). Bioorg Med Chem Lett11:571-4 (2001) 72 kDa type IV collagenase
Name:72 kDa type IV collagenase
Type:Enzyme
Mol. Mass.:73870.36
Organism:Homo sapiens (Human)
Description: P08253
Residue:660
BDBM50097252
NameBDBM50097252
Synonyms:(R)-N'-((S)-3,3-dimethyl-1-oxo-1-((R)-1-phenylethylamino)butan-2-yl)-N4-hydroxy-2-(3-phenylpropyl)succinamide (R)-N1-((S)-3,3-dimethyl-1-oxo-1-((R)-1-phenylethylamino)butan-2-yl)-N4-hydroxy-2-(3-phenylpropyl)succinamide | CHEMBL154551
TypeSmall organic molecule
Emp. Form.C27H37N3O4
Mol. Mass.467.6004
SMILESC[C@@H](NC(=O)[C@@H](NC(=O)[C@H](CCCc1ccccc1)CC(=O)NO)C(C)(C)C)c1ccccc1